logo
HomeBranches & Robots
master develop bug-fixes 5.0 4.5 4.4 4.3 4.2 4.1 4.0 3.4 devel-rt-vel-and-magn devel-andreaM devel-nl devel-gpuhack21 devel-tddft devel-dbgrid-ph devel-andreaM-merge-ready devel-anisotropy devel-bse-io devel-SLK devel-claudio master_gpl issue414 devel-dichroism devel-magnons devel-epw devel-rt-modularization-merge devel-phonon-dynamics devel-rt-modularization devel-bse-io-save devel-cuda-clean devel-double-grid devel-parallel-alloc devel-commutator devel-rt-io devel-yaml-output 4.4_gpl 4.5_gpl issue150-bse-pario-restart issue129-wfout-shell-size issue222-OP_IF_START devel-BSE-finite-q devel-cuda devel-gau-pbe devel-dipoles devel-bz-samp-indexes devel-rt devel-rt-rotate devel-omp devel-cutoff_4.3 devel-cutoff devel-io devel-rt-obs-and-ypp devel-ypp devel-hxc-fft-size devel-haydock-restart devel-par-io devel-slepc devel-current-approach devel-ypp-rt devel-exciton-ypp-spin devel-fft devel-rt-observables devel-sc
Forum

List of test-suite results for branch bug-fixes on machine attacc-lavoro

Revision 20393

Date Tests Compilation Run 1 Run 2 Run 3 Links
Oct-15-Fri

TIME: 23h19m
RUN: 3h20m8s
ROBOT:1
TESTS: all (787 tests)

PROJS: sc rt elph magnetic nl hard nopj kerr qp-dbs p2y a2y
intel IntelMPI
MPI OpenMP SLK SLEPC HDF5_MPI_IO
Precision: single
[serial]

759 ok,
2 fail, 26 skip
[(N=4)] DEFAULT

677 ok,
2 fail, 108 skip
[(N=2)(Threads=2)] RANDOM

677 ok,
2 fail, 182 skip
report
error
conf
logs(tgz)
comp(tgz)

Revision unknown

Date Tests Compilation Links
Oct-13-Wed

TIME: 23h12m
RUN: compilation failed
ROBOT:1
TESTS: all (787 tests)

PROJS: sc rt elph magnetic nl hard nopj kerr qp-dbs p2y a2y
intel IntelMPI
FAILED
Precision: single
report
error
conf
logs(tgz)
comp(tgz)
Oct-11-Mon

TIME: 23h12m
RUN: compilation failed
ROBOT:1
TESTS: all (787 tests)

PROJS: sc rt elph magnetic nl hard nopj kerr qp-dbs p2y a2y
intel IntelMPI
FAILED
Precision: single
report
error
conf
logs(tgz)
comp(tgz)

Revision 20366

Date Tests Compilation Run 1 Run 2 Run 3 Links
Oct-11-Mon

TIME: 16h20m
RUN: 3h41m9s
ROBOT:1
TESTS: all (787 tests)

PROJS: sc rt elph magnetic nl hard nopj kerr qp-dbs p2y a2y
gfortran OpenMPI
MPI OpenMP SLK SLEPC HDF5_MPI_IO
Precision: single
[serial]

758 ok,
3 fail, 26 skip
[(N=4)] DEFAULT

676 ok,
3 fail, 108 skip
[(Threads=2)]

684 ok,
3 fail, 100 skip
report
error
conf
logs(tgz)
comp(tgz)
Oct-11-Mon

TIME: 12h13m
RUN: 3h56m21s
ROBOT:1
TESTS: all (787 tests)

PROJS: sc rt elph magnetic nl hard nopj kerr qp-dbs p2y a2y
intel IntelMPI
MPI OpenMP SLK SLEPC HDF5_MPI_IO
Precision: single
[serial]

756 ok,
5 fail, 26 skip
[(N=4)] DEFAULT

674 ok,
5 fail, 108 skip
[(N=2)(Threads=2)] RANDOM

674 ok,
5 fail, 182 skip
report
error
conf
logs(tgz)
comp(tgz)

Revision unknown

Date Tests Compilation Links
Oct-11-Mon

TIME: 10h20m
RUN: compilation failed
ROBOT:1
TESTS: all (787 tests)

PROJS: sc rt elph magnetic nl hard nopj kerr qp-dbs p2y a2y
intel IntelMPI
FAILED
Precision: single
report
error
conf
logs(tgz)
comp(tgz)
Oct-10-Sun

TIME: 23h12m
RUN: compilation failed
ROBOT:1
TESTS: all (787 tests)

PROJS: sc rt elph magnetic nl hard nopj kerr qp-dbs p2y a2y
intel IntelMPI
FAILED
Precision: single
report
error
conf
logs(tgz)
comp(tgz)
Oct-9-Sat

TIME: 23h12m
RUN: compilation failed
ROBOT:1
TESTS: all (787 tests)

PROJS: sc rt elph magnetic nl hard nopj kerr qp-dbs p2y a2y
intel IntelMPI
FAILED
Precision: single
report
error
conf
logs(tgz)
comp(tgz)

Revision 20366

Date Tests Compilation Run 1 Run 2 Run 3 Links
Oct-8-Fri

TIME: 23h15m
RUN: 3h16m18s
ROBOT:1
TESTS: all (785 tests)

PROJS: sc rt elph magnetic nl hard nopj kerr qp-dbs p2y a2y
intel IntelMPI
MPI OpenMP SLK SLEPC HDF5_MPI_IO
Precision: single
[serial]

750 ok,
9 fail, 26 skip
[(N=4)] DEFAULT

668 ok,
9 fail, 108 skip
[(N=2)(Threads=2)] RANDOM

667 ok,
10 fail, 182 skip
report
error
conf
logs(tgz)
comp(tgz)

Revision unknown

Date Tests Compilation Links
Oct-7-Thu

TIME: 23h12m
RUN: compilation failed
ROBOT:1
TESTS: all (785 tests)

PROJS: sc rt elph magnetic nl hard nopj kerr qp-dbs p2y a2y
intel IntelMPI
FAILED
Precision: single
report
error
conf
logs(tgz)
comp(tgz)
Oct-6-Wed

TIME: 23h12m
RUN: compilation failed
ROBOT:1
TESTS: all (785 tests)

PROJS: sc rt elph magnetic nl hard nopj kerr qp-dbs p2y a2y
intel IntelMPI
FAILED
Precision: single
report
error
conf
logs(tgz)
comp(tgz)
Oct-6-Wed

TIME: 03h12m
RUN: compilation failed
ROBOT:1
TESTS: all (785 tests)

PROJS: sc rt elph magnetic nl hard nopj kerr qp-dbs p2y a2y
intel IntelMPI
FAILED
Precision: single
report
error
conf
logs(tgz)
comp(tgz)

Revision 20366

Date Tests Compilation Run 1 Run 2 Run 3 Links
Oct-5-Tue

TIME: 23h11m
RUN: 4h0m20s
ROBOT:1
TESTS: all (785 tests)

PROJS: sc rt elph magnetic nl hard nopj kerr qp-dbs p2y a2y
gfortran OpenMPI
MPI OpenMP SLK SLEPC HDF5_MPI_IO
Precision: single
[serial]

752 ok,
7 fail, 26 skip
[(N=4)] DEFAULT

670 ok,
7 fail, 108 skip
[(Threads=2)]

678 ok,
7 fail, 100 skip
report
error
conf
logs(tgz)
comp(tgz)
Oct-4-Mon

TIME: 23h15m
RUN: 3h17m8s
ROBOT:1
TESTS: all (785 tests)

PROJS: sc rt elph magnetic nl hard nopj kerr qp-dbs p2y a2y
intel IntelMPI
MPI OpenMP SLK SLEPC HDF5_MPI_IO
Precision: single
[serial]

750 ok,
9 fail, 26 skip
[(N=4)] DEFAULT

668 ok,
9 fail, 108 skip
[(N=2)(Threads=2)] RANDOM

667 ok,
10 fail, 182 skip
report
error
conf
logs(tgz)
comp(tgz)

Revision unknown

Date Tests Compilation Links
Oct-3-Sun

TIME: 23h12m
RUN: compilation failed
ROBOT:1
TESTS: all (785 tests)

PROJS: sc rt elph magnetic nl hard nopj kerr qp-dbs p2y a2y
intel IntelMPI
FAILED
Precision: single
report
error
conf
logs(tgz)
comp(tgz)
Oct-2-Sat

TIME: 23h12m
RUN: compilation failed
ROBOT:1
TESTS: all (785 tests)

PROJS: sc rt elph magnetic nl hard nopj kerr qp-dbs p2y a2y
intel IntelMPI
FAILED
Precision: single
report
error
conf
logs(tgz)
comp(tgz)
Oct-1-Fri

TIME: 23h12m
RUN: compilation failed
ROBOT:1
TESTS: all (785 tests)

PROJS: sc rt elph magnetic nl hard nopj kerr qp-dbs p2y a2y
intel IntelMPI
FAILED
Precision: single
report
error
conf
logs(tgz)
comp(tgz)
Sep-30-Thu

TIME: 23h12m
RUN: compilation failed
ROBOT:1
TESTS: all (785 tests)

PROJS: sc rt elph magnetic nl hard nopj kerr qp-dbs p2y a2y
intel IntelMPI
FAILED
Precision: single
report
error
conf
logs(tgz)
comp(tgz)
Sep-29-Wed

TIME: 23h12m
RUN: compilation failed
ROBOT:1
TESTS: all (785 tests)

PROJS: sc rt elph magnetic nl hard nopj kerr qp-dbs p2y a2y
intel IntelMPI
FAILED
Precision: single
report
error
conf
logs(tgz)
comp(tgz)
Sep-27-Mon

TIME: 23h12m
RUN: compilation failed
ROBOT:1
TESTS: all (785 tests)

PROJS: sc rt elph magnetic nl hard nopj kerr qp-dbs p2y a2y
intel IntelMPI
FAILED
Precision: single
report
error
conf
logs(tgz)
comp(tgz)