logo
HomeBranches & Robots
master develop bug-fixes 5.0 4.5 4.4 4.3 4.2 4.1 4.0 3.4 devel-double-grid devel-fullfreqGW devel-andreaM-merged-with-develop devel-claudio devel-andreaM devel-anisotropy devel-dichroism devel-rt-vel-and-magn devel-magnons fix-bse-finite-q-dir fix-bse-finite-q devel-exciton-phonon fix-issue-555 devel-RIM-W devel-nl devel-gpuhack21 devel-tddft devel-dbgrid-ph devel-andreaM-merge-ready devel-bse-io devel-SLK master_gpl issue414 devel-epw devel-rt-modularization-merge devel-phonon-dynamics devel-rt-modularization devel-bse-io-save devel-cuda-clean devel-parallel-alloc devel-commutator devel-rt-io devel-yaml-output 4.4_gpl 4.5_gpl issue150-bse-pario-restart issue129-wfout-shell-size issue222-OP_IF_START devel-BSE-finite-q devel-cuda devel-gau-pbe devel-dipoles devel-bz-samp-indexes devel-rt devel-rt-rotate devel-omp devel-cutoff_4.3 devel-cutoff devel-io devel-rt-obs-and-ypp devel-ypp devel-hxc-fft-size devel-haydock-restart devel-par-io devel-slepc devel-current-approach devel-ypp-rt devel-exciton-ypp-spin devel-fft devel-rt-observables devel-sc
Forum

List of test-suite results for branch devel-dichroism on machine unimi-XPS-8930

Revision 21221

Date Tests Compilation Run 1 Run 2 Run 3 Run 4 Links
Jan-14-Fri

TIME: 20h34m
RUN: 2h56m45s
ROBOT:4
TESTS: all (760 tests)

PROJS: sc rt elph magnetic nl hard nopj kerr qp-dbs p2y a2y
gfortran MPICH
MPI OpenMP SLK SLEPC HDF5_MPI_IO
Precision: single
[serial]

722 ok,
4 fail, 34 skip
[(N=4)] RANDOM

651 ok,
4 fail, 105 skip
[(N=4)] DEFAULT

649 ok,
4 fail, 107 skip
[(N=2)(Threads=2)] RANDOM

651 ok,
4 fail, 174 skip
report
error
conf
logs(tgz)
comp(tgz)

Revision 21207

Date Tests Compilation Run 1 Run 2 Run 3 Run 4 Links
Jan-13-Thu

TIME: 20h34m
RUN: 2h50m59s
ROBOT:1
TESTS: all (760 tests)

PROJS: sc rt elph magnetic nl hard nopj kerr qp-dbs p2y a2y
gfortran MPICH
MPI OpenMP SLK SLEPC HDF5_MPI_IO
Precision: single
[serial]

718 ok,
6 fail, 36 skip
[(N=4)] RANDOM

647 ok,
6 fail, 107 skip
[(N=4)] DEFAULT

645 ok,
6 fail, 109 skip
[(N=2)(Threads=2)] RANDOM

562 ok,
78 fail, 189 skip
report
error
conf
logs(tgz)
comp(tgz)
Jan-5-Wed

TIME: 04h34m
RUN: 2h55m2s
ROBOT:9
TESTS: all (760 tests)

PROJS: sc rt elph magnetic nl hard nopj kerr qp-dbs p2y a2y
gfortran MPICH
MPI OpenMP SLK SLEPC HDF5_MPI_IO
Precision: single
[serial]

575 ok,
140 fail, 45 skip
[(N=4)] RANDOM

504 ok,
140 fail, 116 skip
[(N=4)] DEFAULT

503 ok,
139 fail, 118 skip
[(N=2)(Threads=2)] RANDOM

438 ok,
193 fail, 198 skip
report
error
conf
logs(tgz)
comp(tgz)

Revision 21122

Date Tests Compilation Run 1 Run 2 Run 3 Run 4 Links
Jan-4-Tue

TIME: 10h35m
RUN: 2h57m2s
ROBOT:7
TESTS: all (760 tests)

PROJS: sc rt elph magnetic nl hard nopj kerr qp-dbs p2y a2y
gfortran MPICH
MPI OpenMP SLK SLEPC HDF5_MPI_IO
Precision: single
[serial]

575 ok,
140 fail, 45 skip
[(N=4)] RANDOM

504 ok,
140 fail, 116 skip
[(N=4)] DEFAULT

503 ok,
139 fail, 118 skip
[(N=2)(Threads=2)] RANDOM

444 ok,
200 fail, 185 skip
report
error
conf
logs(tgz)
comp(tgz)

Revision unknown

Date Tests Compilation Links
Jan-4-Tue

TIME: 04h31m
RUN: compilation failed
ROBOT:6
TESTS: all (760 tests)

PROJS: sc rt elph magnetic nl hard nopj kerr qp-dbs p2y a2y
gfortran MPICH
FAILED
Precision: single
report
error
conf
logs(tgz)
comp(tgz)
Jan-3-Mon

TIME: 04h31m
RUN: compilation failed
ROBOT:5
TESTS: all (760 tests)

PROJS: sc rt elph magnetic nl hard nopj kerr qp-dbs p2y a2y
gfortran MPICH
FAILED
Precision: single
report
error
conf
logs(tgz)
comp(tgz)
Jan-2-Sun

TIME: 04h31m
RUN: compilation failed
ROBOT:4
TESTS: all (760 tests)

PROJS: sc rt elph magnetic nl hard nopj kerr qp-dbs p2y a2y
gfortran MPICH
FAILED
Precision: single
report
error
conf
logs(tgz)
comp(tgz)
Jan-1-Sat

TIME: 04h31m
RUN: compilation failed
ROBOT:3
TESTS: all (760 tests)

PROJS: sc rt elph magnetic nl hard nopj kerr qp-dbs p2y a2y
gfortran MPICH
FAILED
Precision: single
report
error
conf
logs(tgz)
comp(tgz)
Dec-31-Fri

TIME: 04h31m
RUN: compilation failed
ROBOT:2
TESTS: all (760 tests)

PROJS: sc rt elph magnetic nl hard nopj kerr qp-dbs p2y a2y
gfortran MPICH
FAILED
Precision: single
report
error
conf
logs(tgz)
comp(tgz)
Dec-30-Thu

TIME: 04h32m
RUN: compilation failed
ROBOT:1
TESTS: all (760 tests)

PROJS: sc rt elph magnetic nl hard nopj kerr qp-dbs p2y a2y
gfortran MPICH
FAILED
Precision: single
report
error
conf
logs(tgz)
comp(tgz)
Dec-29-Wed

TIME: 04h31m
RUN: compilation failed
ROBOT:6
TESTS: all (760 tests)

PROJS: sc rt elph magnetic nl hard nopj kerr qp-dbs p2y a2y
gfortran MPICH
FAILED
Precision: single
report
error
conf
logs(tgz)
comp(tgz)
Dec-28-Tue

TIME: 04h32m
RUN: compilation failed
ROBOT:5
TESTS: all (760 tests)

PROJS: sc rt elph magnetic nl hard nopj kerr qp-dbs p2y a2y
gfortran MPICH
FAILED
Precision: single
report
error
conf
logs(tgz)
comp(tgz)

Revision 19778

Date Tests Compilation Run 1 Run 2 Run 3 Run 4 Links
Apr-2-Fri

TIME: 17h22m
RUN: 6h40m32s
ROBOT:5
TESTS: all (715 tests)

PROJS: sc rt elph magnetic nl hard nopj qp-dbs p2y a2y
gfortran MPICH
MPI OpenMP SLK SLEPC HDF5_MPI_IO
Precision: single
[serial]

528 ok,
140 fail, 47 skip
[(N=4)] RANDOM

450 ok,
145 fail, 120 skip
[(N=4)] DEFAULT

453 ok,
143 fail, 119 skip
[(N=2)(Threads=2)] RANDOM

392 ok,
205 fail, 187 skip
report
error
conf
logs(tgz)
comp(tgz)
Apr-1-Thu

TIME: 17h22m
RUN: 6h36m36s
ROBOT:4
TESTS: all (715 tests)

PROJS: sc rt elph magnetic nl hard nopj qp-dbs p2y a2y
gfortran MPICH
MPI OpenMP SLEPC HDF5_MPI_IO
Precision: single
[serial]

528 ok,
140 fail, 47 skip
[(N=4)] RANDOM

455 ok,
142 fail, 118 skip
[(N=4)] DEFAULT

455 ok,
142 fail, 118 skip
[(Threads=2)]

432 ok,
167 fail, 116 skip
report
error
conf
logs(tgz)
comp(tgz)

Revision 19777

Date Tests Compilation Run 1 Run 2 Run 3 Run 4 Links
Mar-31-Wed

TIME: 17h21m
RUN: 6h30m52s
ROBOT:3
TESTS: all (715 tests)

PROJS: sc rt elph magnetic nl hard nopj qp-dbs p2y a2y
gfortran MPICH
MPI OpenMP SLEPC HDF5_MPI_IO
Precision: single
[serial]

528 ok,
140 fail, 47 skip
[(N=4)] RANDOM

454 ok,
142 fail, 119 skip
[(N=4)] DEFAULT

455 ok,
142 fail, 118 skip
[(Threads=2)]

426 ok,
173 fail, 116 skip
report
error
conf
logs(tgz)
comp(tgz)
Mar-30-Tue

TIME: 17h21m
RUN: 6h11m7s
ROBOT:2
TESTS: all (715 tests)

PROJS: sc rt elph magnetic nl hard nopj qp-dbs p2y a2y
gfortran MPICH
MPI OpenMP SLEPC HDF5_MPI_IO
Precision: single
[serial]

528 ok,
140 fail, 47 skip
[(N=4)] RANDOM

454 ok,
143 fail, 118 skip
[(N=4)] DEFAULT

455 ok,
142 fail, 118 skip
[(Threads=2)]

417 ok,
182 fail, 116 skip
report
error
conf
logs(tgz)
comp(tgz)
Mar-29-Mon

TIME: 17h22m
RUN: 6h11m38s
ROBOT:1
TESTS: all (715 tests)

PROJS: sc rt elph magnetic nl hard nopj qp-dbs p2y a2y
gfortran MPICH
MPI OpenMP SLEPC HDF5_MPI_IO
Precision: single
[serial]

528 ok,
140 fail, 47 skip
[(N=4)] RANDOM

456 ok,
141 fail, 118 skip
[(N=4)] DEFAULT

455 ok,
142 fail, 118 skip
[(Threads=2)]

414 ok,
185 fail, 116 skip
report
error
conf
logs(tgz)
comp(tgz)

Revision 19748

Date Tests Compilation Run 1 Run 2 Run 3 Run 4 Links
Mar-25-Thu

TIME: 17h21m
RUN: 6h12m57s
ROBOT:8
TESTS: all (705 tests)

PROJS: sc rt elph magnetic nl hard nopj qp-dbs p2y a2y
gfortran MPICH
MPI OpenMP SLEPC HDF5_MPI_IO
Precision: single
[serial]

522 ok,
138 fail, 45 skip
[(N=4)] RANDOM

448 ok,
141 fail, 116 skip
[(N=4)] DEFAULT

449 ok,
140 fail, 116 skip
[(Threads=2)]

425 ok,
166 fail, 114 skip
report
error
conf
logs(tgz)
comp(tgz)
Mar-24-Wed

TIME: 17h22m
RUN: 6h17m57s
ROBOT:7
TESTS: all (705 tests)

PROJS: sc rt elph magnetic nl hard nopj qp-dbs p2y a2y
gfortran MPICH
MPI OpenMP SLEPC HDF5_MPI_IO
Precision: single
[serial]

522 ok,
138 fail, 45 skip
[(N=4)] RANDOM

450 ok,
139 fail, 116 skip
[(N=4)] DEFAULT

449 ok,
140 fail, 116 skip
[(Threads=2)]

420 ok,
171 fail, 114 skip
report
error
conf
logs(tgz)
comp(tgz)

Revision 19742

Date Tests Compilation Run 1 Run 2 Run 3 Run 4 Links
Mar-22-Mon

TIME: 17h22m
RUN: 6h9m20s
ROBOT:5
TESTS: all (705 tests)

PROJS: sc rt elph magnetic nl hard nopj qp-dbs p2y a2y
gfortran MPICH
MPI OpenMP SLEPC HDF5_MPI_IO
Precision: single
[serial]

538 ok,
130 fail, 37 skip
[(N=4)] RANDOM

466 ok,
130 fail, 109 skip
[(N=4)] DEFAULT

465 ok,
132 fail, 108 skip
[(Threads=2)]

447 ok,
152 fail, 106 skip
report
error
conf
logs(tgz)
comp(tgz)