logo
HomeBranches & Robots
master develop bug-fixes 5.0 4.5 4.4 4.3 4.2 4.1 4.0 3.4 devel-double-grid devel-fullfreqGW devel-andreaM-merged-with-develop devel-claudio devel-andreaM devel-anisotropy devel-dichroism devel-rt-vel-and-magn devel-magnons fix-bse-finite-q-dir fix-bse-finite-q devel-exciton-phonon fix-issue-555 devel-RIM-W devel-nl devel-gpuhack21 devel-tddft devel-dbgrid-ph devel-andreaM-merge-ready devel-bse-io devel-SLK master_gpl issue414 devel-epw devel-rt-modularization-merge devel-phonon-dynamics devel-rt-modularization devel-bse-io-save devel-cuda-clean devel-parallel-alloc devel-commutator devel-rt-io devel-yaml-output 4.4_gpl 4.5_gpl issue150-bse-pario-restart issue129-wfout-shell-size issue222-OP_IF_START devel-BSE-finite-q devel-cuda devel-gau-pbe devel-dipoles devel-bz-samp-indexes devel-rt devel-rt-rotate devel-omp devel-cutoff_4.3 devel-cutoff devel-io devel-rt-obs-and-ypp devel-ypp devel-hxc-fft-size devel-haydock-restart devel-par-io devel-slepc devel-current-approach devel-ypp-rt devel-exciton-ypp-spin devel-fft devel-rt-observables devel-sc
Forum

List of test-suite results for branch devel-magnons on machine unimi-XPS-8930

Revision 21121

Date Tests Compilation Run 1 Run 2 Run 3 Run 4 Links
Jan-3-Mon

TIME: 20h04m
RUN: 3h56m13s
ROBOT:2
TESTS: all (828 tests)

PROJS: sc rt elph magnetic nl hard nopj kerr qp-dbs p2y a2y
gfortran MPICH
MPI OpenMP SLK SLEPC HDF5_MPI_IO
Precision: single
[serial]

765 ok,
35 fail, 28 skip
[(N=4)] RANDOM

682 ok,
34 fail, 112 skip
[(N=4)] DEFAULT

680 ok,
34 fail, 114 skip
[(N=2)(Threads=2)] RANDOM

425 ok,
181 fail, 296 skip
report
error
conf
logs(tgz)
comp(tgz)
Jan-2-Sun

TIME: 20h05m
RUN: 3h48m10s
ROBOT:1
TESTS: all (828 tests)

PROJS: sc rt elph magnetic nl hard nopj kerr qp-dbs p2y a2y
gfortran MPICH
MPI OpenMP SLK SLEPC HDF5_MPI_IO
Precision: single
[serial]

765 ok,
35 fail, 28 skip
[(N=4)] RANDOM

677 ok,
38 fail, 113 skip
[(N=4)] DEFAULT

680 ok,
34 fail, 114 skip
[(N=2)(Threads=2)] RANDOM

422 ok,
184 fail, 296 skip
report
error
conf
logs(tgz)
comp(tgz)
Jan-1-Sat

TIME: 20h05m
RUN: 3h49m38s
ROBOT:9
TESTS: all (828 tests)

PROJS: sc rt elph magnetic nl hard nopj kerr qp-dbs p2y a2y
gfortran MPICH
MPI OpenMP SLK SLEPC HDF5_MPI_IO
Precision: single
[serial]

765 ok,
35 fail, 28 skip
[(N=4)] RANDOM

682 ok,
34 fail, 112 skip
[(N=4)] DEFAULT

680 ok,
34 fail, 114 skip
[(N=2)(Threads=2)] RANDOM

420 ok,
186 fail, 296 skip
report
error
conf
logs(tgz)
comp(tgz)
Dec-31-Fri

TIME: 20h04m
RUN: 3h56m49s
ROBOT:8
TESTS: all (828 tests)

PROJS: sc rt elph magnetic nl hard nopj kerr qp-dbs p2y a2y
gfortran MPICH
MPI OpenMP SLK SLEPC HDF5_MPI_IO
Precision: single
[serial]

765 ok,
35 fail, 28 skip
[(N=4)] RANDOM

681 ok,
35 fail, 112 skip
[(N=4)] DEFAULT

680 ok,
34 fail, 114 skip
[(N=2)(Threads=2)] RANDOM

419 ok,
187 fail, 296 skip
report
error
conf
logs(tgz)
comp(tgz)
Dec-30-Thu

TIME: 20h04m
RUN: 3h50m52s
ROBOT:7
TESTS: all (828 tests)

PROJS: sc rt elph magnetic nl hard nopj kerr qp-dbs p2y a2y
gfortran MPICH
MPI OpenMP SLK SLEPC HDF5_MPI_IO
Precision: single
[serial]

765 ok,
35 fail, 28 skip
[(N=4)] RANDOM

682 ok,
34 fail, 112 skip
[(N=4)] DEFAULT

680 ok,
34 fail, 114 skip
[(N=2)(Threads=2)] RANDOM

424 ok,
187 fail, 291 skip
report
error
conf
logs(tgz)
comp(tgz)
Dec-29-Wed

TIME: 20h04m
RUN: 3h53m40s
ROBOT:6
TESTS: all (828 tests)

PROJS: sc rt elph magnetic nl hard nopj kerr qp-dbs p2y a2y
gfortran MPICH
MPI OpenMP SLK SLEPC HDF5_MPI_IO
Precision: single
[serial]

765 ok,
35 fail, 28 skip
[(N=4)] RANDOM

682 ok,
34 fail, 112 skip
[(N=4)] DEFAULT

680 ok,
34 fail, 114 skip
[(N=2)(Threads=2)] RANDOM

424 ok,
182 fail, 296 skip
report
error
conf
logs(tgz)
comp(tgz)
Dec-28-Tue

TIME: 20h04m
RUN: 3h57m14s
ROBOT:5
TESTS: all (828 tests)

PROJS: sc rt elph magnetic nl hard nopj kerr qp-dbs p2y a2y
gfortran MPICH
MPI OpenMP SLK SLEPC HDF5_MPI_IO
Precision: single
[serial]

765 ok,
35 fail, 28 skip
[(N=4)] RANDOM

682 ok,
34 fail, 112 skip
[(N=4)] DEFAULT

680 ok,
34 fail, 114 skip
[(N=2)(Threads=2)] RANDOM

421 ok,
185 fail, 296 skip
report
error
conf
logs(tgz)
comp(tgz)
Dec-27-Mon

TIME: 20h06m
RUN: 5h19m27s
ROBOT:4
TESTS: all (828 tests)

PROJS: sc rt elph magnetic nl hard nopj kerr qp-dbs p2y a2y
gfortran MPICH
MPI OpenMP SLK SLEPC HDF5_MPI_IO
Precision: single
[serial]

765 ok,
35 fail, 28 skip
[(N=4)] RANDOM

682 ok,
34 fail, 112 skip
[(N=4)] DEFAULT

680 ok,
34 fail, 114 skip
[(N=2)(Threads=2)] RANDOM

435 ok,
181 fail, 286 skip
report
error
conf
logs(tgz)
comp(tgz)
Dec-26-Sun

TIME: 19h04m
RUN: 4h25m55s
ROBOT:3
TESTS: all (828 tests)

PROJS: sc rt elph magnetic nl hard nopj kerr qp-dbs p2y a2y
gfortran MPICH
MPI OpenMP SLK SLEPC HDF5_MPI_IO
Precision: single
[serial]

765 ok,
35 fail, 28 skip
[(N=4)] RANDOM

682 ok,
34 fail, 112 skip
[(N=4)] DEFAULT

680 ok,
34 fail, 114 skip
[(N=2)(Threads=2)] RANDOM

420 ok,
186 fail, 296 skip
report
error
conf
logs(tgz)
comp(tgz)
Dec-25-Sat

TIME: 19h04m
RUN: 3h53m41s
ROBOT:2
TESTS: all (828 tests)

PROJS: sc rt elph magnetic nl hard nopj kerr qp-dbs p2y a2y
gfortran MPICH
MPI OpenMP SLK SLEPC HDF5_MPI_IO
Precision: single
[serial]

765 ok,
35 fail, 28 skip
[(N=4)] RANDOM

682 ok,
34 fail, 112 skip
[(N=4)] DEFAULT

680 ok,
34 fail, 114 skip
[(N=2)(Threads=2)] RANDOM

426 ok,
180 fail, 296 skip
report
error
conf
logs(tgz)
comp(tgz)
Dec-24-Fri

TIME: 23h25m
RUN: 4h44m21s
ROBOT:1
TESTS: all (828 tests)

PROJS: sc rt elph magnetic nl hard nopj kerr qp-dbs p2y a2y
gfortran MPICH
MPI OpenMP SLK SLEPC HDF5_MPI_IO
Precision: single
[serial]

765 ok,
35 fail, 28 skip
[(N=4)] RANDOM

681 ok,
34 fail, 113 skip
[(N=4)] DEFAULT

680 ok,
34 fail, 114 skip
[(N=2)(Threads=2)] RANDOM

434 ok,
177 fail, 291 skip
report
error
conf
logs(tgz)
comp(tgz)

Revision unknown

Date Tests Compilation Links
Dec-24-Fri

TIME: 23h13m
RUN: compilation failed
ROBOT:9
TESTS: all (828 tests)

PROJS: sc rt elph magnetic nl hard nopj kerr qp-dbs p2y a2y
gfortran MPICH
FAILED
Precision: single
report
error
conf
logs(tgz)
comp(tgz)
Dec-24-Fri

TIME: 23h01m
RUN: compilation failed
ROBOT:8
TESTS: all (828 tests)

PROJS: sc rt elph magnetic nl hard nopj kerr qp-dbs p2y a2y
gfortran MPICH
FAILED
Precision: single
report
error
conf
logs(tgz)
comp(tgz)
Dec-24-Fri

TIME: 22h37m
RUN: compilation failed
ROBOT:7
TESTS: all (828 tests)

PROJS: sc rt elph magnetic nl hard nopj kerr qp-dbs p2y a2y
gfortran MPICH
FAILED
Precision: single
report
error
conf
logs(tgz)
comp(tgz)

Revision 18994

Date Tests Compilation Run 1 Run 2 Run 3 Run 4 Links
Nov-16-Mon

TIME: 23h08m
RUN: 2h51m32s
ROBOT:8
TESTS: all (704 tests)

PROJS: sc rt pl elph kerr magnetic nl hard nopj qp-dbs p2y a2y
gfortran MPICH
MPI OpenMP SLK SLEPC HDF5_MPI_IO
Precision: single
[serial]

666 ok,
7 fail, 31 skip
[(N=4)] RANDOM

578 ok,
13 fail, 113 skip
[(N=4)] DEFAULT

578 ok,
14 fail, 112 skip
[(Threads=2)]

596 ok,
7 fail, 101 skip
report
error
conf
logs(tgz)
comp(tgz)

Revision 18987

Date Tests Compilation Run 1 Run 2 Run 3 Run 4 Links
Nov-16-Mon

TIME: 00h23m
RUN: 2h43m60s
ROBOT:4
TESTS: all (702 tests)

PROJS: sc rt pl elph kerr magnetic nl hard nopj qp-dbs p2y a2y
gfortran MPICH
MPI OpenMP SLK SLEPC HDF5_MPI_IO
Precision: single
[serial]

666 ok,
5 fail, 31 skip
[(N=4)] RANDOM

572 ok,
13 fail, 117 skip
[(N=4)] DEFAULT

572 ok,
18 fail, 112 skip
[(Threads=2)]

596 ok,
5 fail, 101 skip
report
error
conf
logs(tgz)
comp(tgz)
Nov-15-Sun

TIME: 00h23m
RUN: 2h44m44s
ROBOT:2
TESTS: all (702 tests)

PROJS: sc rt pl elph kerr magnetic nl hard nopj qp-dbs p2y a2y
gfortran MPICH
MPI OpenMP SLK SLEPC HDF5_MPI_IO
Precision: single
[serial]

666 ok,
5 fail, 31 skip
[(N=4)] RANDOM

562 ok,
26 fail, 114 skip
[(N=4)] DEFAULT

581 ok,
9 fail, 112 skip
[(Threads=2)]

596 ok,
5 fail, 101 skip
report
error
conf
logs(tgz)
comp(tgz)

Revision 18984

Date Tests Compilation Run 1 Run 2 Run 3 Run 4 Links
Nov-13-Fri

TIME: 23h54m
RUN: 2h43m9s
ROBOT:9
TESTS: all (700 tests)

PROJS: sc rt pl elph kerr magnetic nl hard nopj qp-dbs p2y a2y
gfortran MPICH
MPI OpenMP SLK SLEPC HDF5_MPI_IO
Precision: single
[serial]

649 ok,
20 fail, 31 skip
[(N=4)] RANDOM

556 ok,
31 fail, 113 skip
[(N=4)] DEFAULT

564 ok,
24 fail, 112 skip
[(Threads=2)]

579 ok,
20 fail, 101 skip
report
error
conf
logs(tgz)
comp(tgz)

Revision 18954

Date Tests Compilation Run 1 Run 2 Run 3 Run 4 Links
Nov-11-Wed

TIME: 23h53m
RUN: 2h43m57s
ROBOT:5
TESTS: all (700 tests)

PROJS: sc rt pl elph kerr magnetic nl hard nopj qp-dbs p2y a2y
gfortran MPICH
MPI OpenMP SLK SLEPC HDF5_MPI_IO
Precision: single
[serial]

666 ok,
3 fail, 31 skip
[(N=4)] RANDOM

568 ok,
20 fail, 112 skip
[(N=4)] DEFAULT

578 ok,
10 fail, 112 skip
[(Threads=2)]

595 ok,
4 fail, 101 skip
report
error
conf
logs(tgz)
comp(tgz)

Revision 18952

Date Tests Compilation Run 1 Run 2 Run 3 Run 4 Links
Nov-9-Mon

TIME: 23h53m
RUN: 2h43m37s
ROBOT:1
TESTS: all (699 tests)

PROJS: sc rt pl elph kerr magnetic nl hard nopj qp-dbs p2y a2y
gfortran MPICH
MPI OpenMP SLK SLEPC HDF5_MPI_IO
Precision: single
[serial]

666 ok,
2 fail, 31 skip
[(N=4)] RANDOM

565 ok,
21 fail, 113 skip
[(N=4)] DEFAULT

583 ok,
4 fail, 112 skip
[(Threads=2)]

596 ok,
2 fail, 101 skip
report
error
conf
logs(tgz)
comp(tgz)