logo
HomeBranches & Robots
master develop bug-fixes 5.0 4.5 4.4 4.3 4.2 4.1 4.0 3.4 devel-double-grid devel-fullfreqGW devel-claudio devel-andreaM-merged-with-develop devel-andreaM devel-anisotropy devel-dichroism devel-rt-vel-and-magn devel-magnons fix-bse-finite-q-dir fix-bse-finite-q devel-exciton-phonon fix-issue-555 devel-RIM-W devel-nl devel-gpuhack21 devel-tddft devel-dbgrid-ph devel-andreaM-merge-ready devel-bse-io devel-SLK master_gpl issue414 devel-epw devel-rt-modularization-merge devel-phonon-dynamics devel-rt-modularization devel-bse-io-save devel-cuda-clean devel-parallel-alloc devel-commutator devel-rt-io devel-yaml-output 4.4_gpl 4.5_gpl issue150-bse-pario-restart issue129-wfout-shell-size issue222-OP_IF_START devel-BSE-finite-q devel-cuda devel-gau-pbe devel-dipoles devel-bz-samp-indexes devel-rt devel-rt-rotate devel-omp devel-cutoff_4.3 devel-cutoff devel-io devel-rt-obs-and-ypp devel-ypp devel-hxc-fft-size devel-haydock-restart devel-par-io devel-slepc devel-current-approach devel-ypp-rt devel-exciton-ypp-spin devel-fft devel-rt-observables devel-sc
Forum

List of test-suite results for branch fix-issue-555 on machine unimi-XPS-8930

Revision 20475

Date Tests Compilation Run 1 Run 2 Run 3 Run 4 Links
Nov-10-Wed

TIME: 01h35m
RUN: 2h55m25s
ROBOT:1
TESTS: all (794 tests)

PROJS: sc rt elph magnetic nl hard nopj kerr qp-dbs p2y a2y
gfortran MPICH
MPI OpenMP SLK SLEPC HDF5_MPI_IO
Precision: single
[serial]

766 ok,
0 fail, 28 skip
[(N=4)] RANDOM

683 ok,
1 fail, 110 skip
[(N=4)] DEFAULT

684 ok,
0 fail, 110 skip
[(N=2)(Threads=2)] RANDOM

683 ok,
1 fail, 184 skip
report
error
conf
logs(tgz)
comp(tgz)
Nov-9-Tue

TIME: 17h32m
RUN: 2h53m19s
ROBOT:9
TESTS: all (794 tests)

PROJS: sc rt elph magnetic nl hard nopj kerr qp-dbs p2y a2y
gfortran MPICH
MPI OpenMP SLK SLEPC HDF5_MPI_IO
Precision: single
[serial]

766 ok,
0 fail, 28 skip
[(N=4)] RANDOM

683 ok,
1 fail, 110 skip
[(N=4)] DEFAULT

684 ok,
0 fail, 110 skip
[(N=2)(Threads=2)] RANDOM

682 ok,
2 fail, 184 skip
report
error
conf
logs(tgz)
comp(tgz)

Revision 20482

Date Tests Compilation Run 1 Run 2 Run 3 Run 4 Links
Nov-9-Tue

TIME: 12h07m
RUN: 2h55m31s
ROBOT:7
TESTS: all (794 tests)

PROJS: sc rt elph magnetic nl hard nopj kerr qp-dbs p2y a2y
gfortran MPICH
MPI OpenMP SLK SLEPC HDF5_MPI_IO
Precision: single
[serial]

751 ok,
7 fail, 36 skip
[(N=4)] RANDOM

669 ok,
7 fail, 118 skip
[(N=4)] DEFAULT

669 ok,
7 fail, 118 skip
[(N=2)(Threads=2)] RANDOM

669 ok,
7 fail, 192 skip
report
error
conf
logs(tgz)
comp(tgz)

Revision unknown

Date Tests Compilation Links
Nov-9-Tue

TIME: 10h35m
RUN: compilation failed
ROBOT:6
TESTS: all (794 tests)

PROJS: sc rt elph magnetic nl hard nopj kerr qp-dbs p2y a2y
gfortran MPICH
FAILED
Precision: single
report
error
conf
logs(tgz)
comp(tgz)
Nov-9-Tue

TIME: 10h33m
RUN: compilation failed
ROBOT:5
TESTS: all (794 tests)

PROJS: sc rt elph magnetic nl hard nopj kerr qp-dbs p2y a2y
-
FAILED
Precision:
report
error
conf
logs(tgz)
comp(tgz)
Nov-9-Tue

TIME: 10h30m
RUN: compilation failed
ROBOT:4
TESTS: all (794 tests)

PROJS: sc rt elph magnetic nl hard nopj kerr qp-dbs p2y a2y
-
FAILED
Precision:
report
error
conf
logs(tgz)
comp(tgz)
Nov-9-Tue

TIME: 10h25m
RUN: compilation failed
ROBOT:3
TESTS: all (794 tests)

PROJS: sc rt elph magnetic nl hard nopj kerr qp-dbs p2y a2y
-
FAILED
Precision:
report
error
conf
logs(tgz)
comp(tgz)
Nov-9-Tue

TIME: 09h40m
RUN: compilation failed
ROBOT:2
TESTS: all (794 tests)

PROJS: sc rt elph magnetic nl hard nopj kerr qp-dbs p2y a2y
gfortran MPICH
FAILED
Precision: single
report
error
conf
logs(tgz)
comp(tgz)
Nov-9-Tue

TIME: 00h30m
RUN: compilation failed
ROBOT:1
TESTS: all (794 tests)

PROJS: sc rt elph magnetic nl hard nopj kerr qp-dbs p2y a2y
gfortran MPICH
FAILED
Precision: single
report
error
conf
logs(tgz)
comp(tgz)